Reaction Details
TargetMelanin-concentrating hormone receptor 1
LigandBDBM50353459
Substrate/Competitorn/a
Meas. Tech.ChEMBL_768152 (CHEMBL1833190)
Ki 6.5±n/a nM
Citation Lu, KJiang, YChen, BEldemenky, EMMa, GPackiarajan, MChandrasena, GWhite, ADJones, KALi, BHong, SP Strategies to lower the Pgp efflux liability in a series of potent indole azetidine MCHR1 antagonists. Bioorg Med Chem Lett21:5310-4 (2011) 
 
Melanin-concentrating hormone receptor 1
Name:Melanin-concentrating hormone receptor 1
Type:Enzyme Catalytic Domain
Mol. Mass.:39075.64
Organism:RAT
Description:Melanin Concentrating Hormone 1 GPR24 RAT::P97639
Residue:353
BDBM50353459
NameBDBM50353459
Synonyms:CHEMBL1830053
TypeSmall organic molecule
Emp. Form.C24H23ClFN3O
Mol. Mass.423.91
SMILESFCCN1CC(C1)N1CCc2cc(ccc12)-n1ccc(cc1=O)-c1ccc(Cl)cc1