Reaction Details
TargetMuscarinic acetylcholine receptor M1
LigandBDBM50356971
Substrate/Competitorn/a
Meas. Tech.ChEMBL_788045 (CHEMBL1919024)
EC50 250±n/a nM
Citation Lebois, EPDigby, GJSheffler, DJMelancon, BJTarr, JCCho, HPMiller, NRMorrison, RBridges, TMXiang, ZScott Daniels, JWood, MRConn, PJLindsley, CW Development of a highly selective, orally bioavailable and CNS penetrant M1 agonist derived from the MLPCN probe ML071. Bioorg Med Chem Lett21:6451-5 (2011) 
 
Muscarinic acetylcholine receptor M1
Name:Muscarinic acetylcholine receptor M1
Type:Enzyme Catalytic Domain
Mol. Mass.:51390.46
Organism:RAT
Description:P08482
Residue:460
BDBM50356971
NameBDBM50356971
Synonyms:CHEMBL1916228
TypeSmall organic molecule
Emp. Form.C21H31N3O4
Mol. Mass.389.4885
SMILESCCOC(=O)N1CCC(CC1)N1CCC[C@H](C1)NC(=O)c1cccc(OC)c1