Reaction Details
TargetMuscarinic acetylcholine receptor M4
LigandBDBM50356977
Substrate/Competitorn/a
Meas. Tech.ChEMBL_788049 (CHEMBL1919028)
EC50>10000±n/a nM
Citation Lebois, EPDigby, GJSheffler, DJMelancon, BJTarr, JCCho, HPMiller, NRMorrison, RBridges, TMXiang, ZScott Daniels, JWood, MRConn, PJLindsley, CW Development of a highly selective, orally bioavailable and CNS penetrant M1 agonist derived from the MLPCN probe ML071. Bioorg Med Chem Lett21:6451-5 (2011) 
 
Muscarinic acetylcholine receptor M4
Name:Muscarinic acetylcholine receptor M4
Type:Enzyme Catalytic Domain
Mol. Mass.:52841.70
Organism:RAT
Description:Cholinergic, muscarinic M4 CHRM4 RAT::P08485
Residue:477
BDBM50356977
NameBDBM50356977
Synonyms:CHEMBL1916232
TypeSmall organic molecule
Emp. Form.C18H27N3O3S
Mol. Mass.365.49
SMILESCCOC(=O)N1CCC(CC1)N1CCC[C@H](C1)NC(=O)c1cccs1