Reaction Details
TargetMuscarinic acetylcholine receptor M2
LigandBDBM50356977
Substrate/Competitorn/a
Meas. Tech.ChEMBL_788047 (CHEMBL1919026)
EC50>10000±n/a nM
Citation Lebois, EPDigby, GJSheffler, DJMelancon, BJTarr, JCCho, HPMiller, NRMorrison, RBridges, TMXiang, ZScott Daniels, JWood, MRConn, PJLindsley, CW Development of a highly selective, orally bioavailable and CNS penetrant M1 agonist derived from the MLPCN probe ML071. Bioorg Med Chem Lett21:6451-5 (2011) 
 
Muscarinic acetylcholine receptor M2
Name:Muscarinic acetylcholine receptor M2
Type:Enzyme Catalytic Domain
Mol. Mass.:51555.53
Organism:RAT
Description:P10980
Residue:466
BDBM50356977
NameBDBM50356977
Synonyms:CHEMBL1916232
TypeSmall organic molecule
Emp. Form.C18H27N3O3S
Mol. Mass.365.49
SMILESCCOC(=O)N1CCC(CC1)N1CCC[C@H](C1)NC(=O)c1cccs1