Reaction Details
TargetMelanin-concentrating hormone receptor 1
LigandBDBM50150715
Substrate/Competitorn/a
Meas. Tech.ChEMBL_787535 (CHEMBL1919496)
IC50 5.5±n/a nM
Citation Kasai, SKamaura, MKamata, MAso, KOgino, HNakano, YWatanabe, KKaisho, TTawada, MNagisa, YTakekawa, SKato, KSuzuki, NIshihara, Y Melanin-concentrating hormone receptor 1 antagonists: synthesis, structure-activity relationship, docking studies, and biological evaluation of 2,3,4,5-tetrahydro-1H-3-benzazepine derivatives. Bioorg Med Chem19:6261-73 (2011) 
 
Melanin-concentrating hormone receptor 1
Name:Melanin-concentrating hormone receptor 1
Type:G Protein-Coupled Receptor (GPCR)
Mol. Mass.:45976.27
Organism:Homo sapiens (Human)
Description:Membranes from CHO-K1 cells stably expressing human MCH1R were used in assays.
Residue:422
BDBM50150715
NameBDBM50150715
Synonyms:4''-Fluoro-biphenyl-4-carboxylic acid (6-dimethylaminomethyl-5,6,7,8-tetrahydro-naphthalen-2-yl)-amide CHEMBL178707 T-226296
TypeSmall organic molecule
Emp. Form.C26H27FN2O
Mol. Mass.402.5038
SMILESCN(C)CC1CCc2cc(NC(=O)c3ccc(cc3)-c3ccc(F)cc3)ccc2C1