Reaction Details
TargetCytochrome P450 3A4
LigandBDBM50358195
Substrate/Competitorn/a
Meas. Tech.ChEMBL_790052 (CHEMBL1926384)
IC50<1000±n/a nM
Citation Kaku, THitaka, TOjida, AMatsunaga, NAdachi, MTanaka, THara, TYamaoka, MKusaka, MOkuda, TAsahi, SFuruya, STasaka, A Discovery of orteronel (TAK-700), a naphthylmethylimidazole derivative, as a highly selective 17,20-lyase inhibitor with potential utility in the treatment of prostate cancer. Bioorg Med Chem19:6383-99 (2011) 
 
Cytochrome P450 3A4
Name:Cytochrome P450 3A4
Type:Enzyme
Mol. Mass.:57349.57
Organism:Homo sapiens (Human)
Description:n/a
Residue:503
BDBM50358195
NameBDBM50358195
Synonyms:CHEMBL1921979
TypeSmall organic molecule
Emp. Form.C18H17N3O
Mol. Mass.291.3471
SMILESCNC(=O)c1ccc2cc(ccc2c1)C1CCn2cncc12