Reaction Details
TargetCytochrome P450 2C9
LigandBDBM50358201
Substrate/Competitorn/a
Meas. Tech.ChEMBL_790068 (CHEMBL1925458)
IC50>30000±n/a nM
Citation Kaku, THitaka, TOjida, AMatsunaga, NAdachi, MTanaka, THara, TYamaoka, MKusaka, MOkuda, TAsahi, SFuruya, STasaka, A Discovery of orteronel (TAK-700), a naphthylmethylimidazole derivative, as a highly selective 17,20-lyase inhibitor with potential utility in the treatment of prostate cancer. Bioorg Med Chem19:6383-99 (2011) 
 
Cytochrome P450 2C9
Name:Cytochrome P450 2C9
Type:Enzyme
Mol. Mass.:55636.33
Organism:Homo sapiens (Human)
Description:P11712
Residue:490
BDBM50358201
NameBDBM50358201
Synonyms:CHEMBL1921976 | US9611270, orteronel
TypeSmall organic molecule
Emp. Form.C18H17N3O2
Mol. Mass.307.3465
SMILESCNC(=O)c1ccc2cc(ccc2c1)[C@@]1(O)CCn2cncc12