Reaction Details
TargetCytochrome P450 3A4
LigandBDBM50338363
Substrate/Competitorn/a
Meas. Tech.ChEMBL_790052 (CHEMBL1926384)
IC50 3600±n/a nM
Citation Kaku, THitaka, TOjida, AMatsunaga, NAdachi, MTanaka, THara, TYamaoka, MKusaka, MOkuda, TAsahi, SFuruya, STasaka, A Discovery of orteronel (TAK-700), a naphthylmethylimidazole derivative, as a highly selective 17,20-lyase inhibitor with potential utility in the treatment of prostate cancer. Bioorg Med Chem19:6383-99 (2011) 
 
Cytochrome P450 3A4
Name:Cytochrome P450 3A4
Type:Enzyme
Mol. Mass.:57349.57
Organism:Homo sapiens (Human)
Description:n/a
Residue:503
BDBM50338363
NameBDBM50338363
Synonyms:CHEMBL1682893 | rac-6-[1-Hydroxy-1-(1H-imidazol-4-yl)-2-methylpropyl]-Nmethyl-2-naphthamide
TypeSmall organic molecule
Emp. Form.C19H21N3O2
Mol. Mass.323.3889
SMILESCNC(=O)c1ccc2cc(ccc2c1)C(O)(C(C)C)c1cnc[nH]1