Reaction Details
TargetSteroid 17-alpha-hydroxylase/17,20 lyase
LigandBDBM50358199
Substrate/Competitorn/a
Meas. Tech.ChEMBL_790048 (CHEMBL1926380)
IC50 290±n/a nM
Citation Kaku, THitaka, TOjida, AMatsunaga, NAdachi, MTanaka, THara, TYamaoka, MKusaka, MOkuda, TAsahi, SFuruya, STasaka, A Discovery of orteronel (TAK-700), a naphthylmethylimidazole derivative, as a highly selective 17,20-lyase inhibitor with potential utility in the treatment of prostate cancer. Bioorg Med Chem19:6383-99 (2011) 
 
Steroid 17-alpha-hydroxylase/17,20 lyase
Name:Steroid 17-alpha-hydroxylase/17,20 lyase
Type:Enzyme
Mol. Mass.:57382.42
Organism:Homo sapiens (Human)
Description:E.coli expressing human CYP17
Residue:508
BDBM50358199
NameBDBM50358199
Synonyms:CHEMBL1921983
TypeSmall organic molecule
Emp. Form.C20H19N3O2
Mol. Mass.333.3838
SMILESOC1(CCn2cncc12)c1ccc2cc(ccc2c1)C(=O)NC1CC1