Reaction Details
TargetCytochrome P450 3A4
LigandBDBM50358198
Substrate/Competitorn/a
Meas. Tech.ChEMBL_790052 (CHEMBL1926384)
IC50>10000±n/a nM
Citation Kaku, THitaka, TOjida, AMatsunaga, NAdachi, MTanaka, THara, TYamaoka, MKusaka, MOkuda, TAsahi, SFuruya, STasaka, A Discovery of orteronel (TAK-700), a naphthylmethylimidazole derivative, as a highly selective 17,20-lyase inhibitor with potential utility in the treatment of prostate cancer. Bioorg Med Chem19:6383-99 (2011) 
 
Cytochrome P450 3A4
Name:Cytochrome P450 3A4
Type:Enzyme
Mol. Mass.:57349.57
Organism:Homo sapiens (Human)
Description:n/a
Residue:503
BDBM50358198
NameBDBM50358198
Synonyms:CHEMBL1921982
TypeSmall organic molecule
Emp. Form.C19H19N3O2
Mol. Mass.321.3731
SMILESCCNC(=O)c1ccc2cc(ccc2c1)C1(O)CCn2cncc12