Reaction Details
TargetCoagulation factor X
LigandBDBM50358872
Substrate/Competitorn/a
Meas. Tech.ChEMBL_790745 (CHEMBL1926198)
IC50 51±n/a nM
Citation Shi, YO'Connor, SPSitkoff, DZhang, JShi, MBisaha, SNWang, YLi, CRuan, ZLawrence, RMKlei, HEKish, KLiu, ECSeiler, SMSchweizer, LSteinbacher, TESchumacher, WARobl, JAMacor, JEAtwal, KSStein, PD Arylsulfonamidopiperidone derivatives as a novel class of factor Xa inhibitors. Bioorg Med Chem Lett21:7516-21 (2011) 
 
Coagulation factor X
Name:Coagulation factor X
Type:Enzyme
Mol. Mass.:54726.60
Organism:Homo sapiens (Human)
Description:n/a
Residue:488
BDBM50358872
NameBDBM50358872
Synonyms:CHEMBL1923456
TypeSmall organic molecule
Emp. Form.C19H22ClN3O4S3
Mol. Mass.488.044
SMILESClc1ccc(s1)-c1ccc(s1)S(=O)(=O)N[C@H]1CCCN(CC(=O)N2CCCC2)C1=O