Reaction Details
TargetCoagulation factor X
LigandBDBM50358885
Substrate/Competitorn/a
Meas. Tech.ChEMBL_790745 (CHEMBL1926198)
IC50 14±n/a nM
Citation Shi, YO'Connor, SPSitkoff, DZhang, JShi, MBisaha, SNWang, YLi, CRuan, ZLawrence, RMKlei, HEKish, KLiu, ECSeiler, SMSchweizer, LSteinbacher, TESchumacher, WARobl, JAMacor, JEAtwal, KSStein, PD Arylsulfonamidopiperidone derivatives as a novel class of factor Xa inhibitors. Bioorg Med Chem Lett21:7516-21 (2011) 
 
Coagulation factor X
Name:Coagulation factor X
Type:Enzyme
Mol. Mass.:54726.60
Organism:Homo sapiens (Human)
Description:n/a
Residue:488
BDBM50358885
NameBDBM50358885
Synonyms:CHEMBL1923470
TypeSmall organic molecule
Emp. Form.C25H30ClN5O5S
Mol. Mass.548.054
SMILESNC(=O)N1CC2CC(C1)CN(C2)C(=O)CN1CCC[C@H](NS(=O)(=O)c2ccc3cc(Cl)ccc3c2)C1=O