Reaction Details
TargetUrokinase-type plasminogen activator
LigandBDBM50358883
Substrate/Competitorn/a
Meas. Tech.ChEMBL_790764 (CHEMBL1926217)
Ki 15100±n/a nM
Citation Shi, YO'Connor, SPSitkoff, DZhang, JShi, MBisaha, SNWang, YLi, CRuan, ZLawrence, RMKlei, HEKish, KLiu, ECSeiler, SMSchweizer, LSteinbacher, TESchumacher, WARobl, JAMacor, JEAtwal, KSStein, PD Arylsulfonamidopiperidone derivatives as a novel class of factor Xa inhibitors. Bioorg Med Chem Lett21:7516-21 (2011) 
 
Urokinase-type plasminogen activator
Name:Urokinase-type plasminogen activator
Type:Enzyme
Mol. Mass.:48528.62
Organism:Homo sapiens (Human)
Description:P00749
Residue:431
BDBM50358883
NameBDBM50358883
Synonyms:CHEMBL1923468
TypeSmall organic molecule
Emp. Form.C28H29ClN4O5S
Mol. Mass.569.072
SMILESClc1ccc2cc(ccc2c1)S(=O)(=O)N[C@H]1CCCN(CC(=O)N2C[C@@H]3C[C@H](C2)c2cccc(=O)n2C3)C1=O