Reaction Details
TargetC-C chemokine receptor type 2
LigandBDBM50359014
Substrate/Competitorn/a
Meas. Tech.ChEMBL_791034 (CHEMBL1925695)
Ki 16±n/a nM
Citation Wang, GZHaile, PADaniel, TBelot, BViet, AQGoodman, KBSha, DDowdell, SEVarga, NHong, XChakravorty, SWebb, CCornejo, COlzinski, ABernard, REvans, CEmmons, ABriand, JChung, CWQuek, RLee, DGough, PJSehon, CA CCR2 receptor antagonists: optimization of biaryl sulfonamides to increase activity in whole blood. Bioorg Med Chem Lett21:7291-4 (2011) 
 
C-C chemokine receptor type 2
Name:C-C chemokine receptor type 2
Type:Enzyme
Mol. Mass.:41932.32
Organism:Homo sapiens (Human)
Description:P41597
Residue:374
BDBM50359014
NameBDBM50359014
Synonyms:CHEMBL1924015
TypeSmall organic molecule
Emp. Form.C28H28Cl2F3N3O4S
Mol. Mass.630.506
SMILESCc1cc(Oc2ccc(cc2)C(=O)NCCN2CCCCC2)c(NS(=O)(=O)c2ccc(Cl)c(c2)C(F)(F)F)cc1Cl