Reaction Details
TargetC-C chemokine receptor type 2
LigandBDBM50359019
Substrate/Competitorn/a
Meas. Tech.ChEMBL_791037 (CHEMBL1925747)
Kd 3981.07±n/a nM
Citation Wang, GZHaile, PADaniel, TBelot, BViet, AQGoodman, KBSha, DDowdell, SEVarga, NHong, XChakravorty, SWebb, CCornejo, COlzinski, ABernard, REvans, CEmmons, ABriand, JChung, CWQuek, RLee, DGough, PJSehon, CA CCR2 receptor antagonists: optimization of biaryl sulfonamides to increase activity in whole blood. Bioorg Med Chem Lett21:7291-4 (2011) 
 
C-C chemokine receptor type 2
Name:C-C chemokine receptor type 2
Type:Enzyme
Mol. Mass.:41932.32
Organism:Homo sapiens (Human)
Description:P41597
Residue:374
BDBM50359019
NameBDBM50359019
Synonyms:CHEMBL1924020
TypeSmall organic molecule
Emp. Form.C26H22Cl2F5N3O4S
Mol. Mass.638.434
SMILESFC(F)(F)c1cc(ccc1Cl)S(=O)(=O)Nc1cc(Cl)ccc1Oc1ccc(cc1)C(=O)NCCN1CCC(F)(F)C1