Reaction Details
TargetC-C chemokine receptor type 2
LigandBDBM50359018
Substrate/Competitorn/a
Meas. Tech.ChEMBL_791037 (CHEMBL1925747)
Kd 398.11±n/a nM
Citation Wang, GZHaile, PADaniel, TBelot, BViet, AQGoodman, KBSha, DDowdell, SEVarga, NHong, XChakravorty, SWebb, CCornejo, COlzinski, ABernard, REvans, CEmmons, ABriand, JChung, CWQuek, RLee, DGough, PJSehon, CA CCR2 receptor antagonists: optimization of biaryl sulfonamides to increase activity in whole blood. Bioorg Med Chem Lett21:7291-4 (2011) 
 
C-C chemokine receptor type 2
Name:C-C chemokine receptor type 2
Type:Enzyme
Mol. Mass.:41932.32
Organism:Homo sapiens (Human)
Description:P41597
Residue:374
BDBM50359018
NameBDBM50359018
Synonyms:CHEMBL1924019
TypeSmall organic molecule
Emp. Form.C27H26Cl2F3N3O5S
Mol. Mass.632.479
SMILESCOc1cc(Oc2ccc(cc2)C(=O)NCCN2CCCC2)c(NS(=O)(=O)c2ccc(Cl)c(c2)C(F)(F)F)cc1Cl