Reaction Details
TargetFocal adhesion kinase 1
LigandBDBM50361217
Substrate/Competitorn/a
Meas. Tech.ChEMBL_794848 (CHEMBL1936031)
IC50>10000±n/a nM
Citation Zificsak, CAGingrich, DEBreslin, HJDunn, DDMilkiewicz, KLTheroff, JPThieu, TVUnderiner, TLWeinberg, LRAimone, LDAlbom, MSMason, JLSaville, LHusten, JAngeles, TSFinn, JPJan, MO'Kane, TMDobrzanski, PDorsey, BD Optimization of a novel kinase inhibitor scaffold for the dual inhibition of JAK2 and FAK kinases. Bioorg Med Chem Lett22:133-7 (2011) 
 
Focal adhesion kinase 1
Name:Focal adhesion kinase 1
Type:Tyrosine-protein kinase
Mol. Mass.:119233.17
Organism:Homo sapiens (Human)
Description:Q05397
Residue:1052
BDBM50361217
NameBDBM50361217
Synonyms:CHEMBL1934346
TypeSmall organic molecule
Emp. Form.C23H24N8O
Mol. Mass.428.4897
SMILESNC(=O)CN1CCC(CC1)c1ccc(Nc2ncc3ccc(-c4ncccn4)n3n2)cc1