Reaction Details
TargetHistamine H3 receptor
LigandBDBM50361235
Substrate/Competitorn/a
Meas. Tech.ChEMBL_794859 (CHEMBL1936095)
Ki 0.17±n/a nM
Citation Semple, GSantora, VJSmith, JMCovel, JAHayashi, RGallardo, CIbarra, JBSchultz, JAPark, DMEstrada, SAHofilena, BJSmith, BMRen, ASuarez, MFrazer, JEdwards, JEHart, RHauser, EKLorea, JGrottick, AJ Identification of biaryl sulfone derivatives as antagonists of the histamine H3 receptor: discovery of (R)-1-(2-(4'-(3-methoxypropylsulfonyl)biphenyl-4-yl)ethyl)-2-methylpyrrolidine (APD916). Bioorg Med Chem Lett22:71-5 (2011) 
 
Histamine H3 receptor
Name:Histamine H3 receptor
Type:G Protein-Coupled Receptor (GPCR)
Mol. Mass.:48607.98
Organism:Rattus norvegicus (rat)
Description:n/a
Residue:445
BDBM50361235
NameBDBM50361235
Synonyms:CHEMBL1934525
TypeSmall organic molecule
Emp. Form.C25H33NO3S
Mol. Mass.427.599
SMILESC[C@@H]1CCCN1CCc1ccc(cc1)-c1ccc(cc1)S(=O)(=O)CC1CCOCC1