Reaction Details
TargetPotassium voltage-gated channel subfamily H member 2
LigandBDBM50361231
Substrate/Competitorn/a
Meas. Tech.ChEMBL_794861 (CHEMBL1936097)
IC50 7700±n/a nM
Citation Semple, GSantora, VJSmith, JMCovel, JAHayashi, RGallardo, CIbarra, JBSchultz, JAPark, DMEstrada, SAHofilena, BJSmith, BMRen, ASuarez, MFrazer, JEdwards, JEHart, RHauser, EKLorea, JGrottick, AJ Identification of biaryl sulfone derivatives as antagonists of the histamine H3 receptor: discovery of (R)-1-(2-(4'-(3-methoxypropylsulfonyl)biphenyl-4-yl)ethyl)-2-methylpyrrolidine (APD916). Bioorg Med Chem Lett22:71-5 (2011) 
 
Potassium voltage-gated channel subfamily H member 2
Name:Potassium voltage-gated channel subfamily H member 2
Type:Multi-pass membrane protein
Mol. Mass.:126672.65
Organism:Homo sapiens (Human)
Description:Q12809
Residue:1159
BDBM50361231
NameBDBM50361231
Synonyms:CHEMBL1934521
TypeSmall organic molecule
Emp. Form.C21H27NO3S
Mol. Mass.373.509
SMILESC[C@@H]1CCCN1CCc1ccc(cc1)-c1ccc(cc1)S(=O)(=O)CCO