Reaction Details
TargetCytochrome P450 3A4
LigandBDBM50361233
Substrate/Competitorn/a
Meas. Tech.ChEMBL_794978 (CHEMBL1936305)
IC50>40000±n/a nM
Citation Semple, GSantora, VJSmith, JMCovel, JAHayashi, RGallardo, CIbarra, JBSchultz, JAPark, DMEstrada, SAHofilena, BJSmith, BMRen, ASuarez, MFrazer, JEdwards, JEHart, RHauser, EKLorea, JGrottick, AJ Identification of biaryl sulfone derivatives as antagonists of the histamine H3 receptor: discovery of (R)-1-(2-(4'-(3-methoxypropylsulfonyl)biphenyl-4-yl)ethyl)-2-methylpyrrolidine (APD916). Bioorg Med Chem Lett22:71-5 (2011) 
 
Cytochrome P450 3A4
Name:Cytochrome P450 3A4
Type:Enzyme
Mol. Mass.:57349.57
Organism:Homo sapiens (Human)
Description:n/a
Residue:503
BDBM50361233
NameBDBM50361233
Synonyms:CHEMBL1934523
TypeSmall organic molecule
Emp. Form.C23H31NO3S
Mol. Mass.401.562
SMILESCOCCCS(=O)(=O)c1ccc(cc1)-c1ccc(CCN2CCC[C@H]2C)cc1