Reaction Details
TargetSerine/threonine-protein kinase mTOR
LigandBDBM50361648
Substrate/Competitorn/a
Meas. Tech.ChEMBL_799353 (CHEMBL1942066)
Ki 3900±n/a nM
Citation Murphy, STAlton, GBailey, SBaxi, SMBurke, BJChappie, TAErmolieff, JFerre, RGreasley, SHickey, MHumphrey, JKablaoui, NKath, JKazmirski, SKraus, MKupchinsky, SLi, JLingardo, LMarx, MARichter, DTanis, SPTran, KVernier, WXie, ZYin, MJYu, XH Discovery of novel, potent, and selective inhibitors of 3-phosphoinositide-dependent kinase (PDK1). J Med Chem54:8490-500 (2011) 
 
Serine/threonine-protein kinase mTOR
Name:Serine/threonine-protein kinase mTOR
Type:Rapamycin target protein
Mol. Mass.:288917.12
Organism:Homo sapiens (Human)
Description:P42345
Residue:2549
BDBM50361648
NameBDBM50361648
Synonyms:CHEMBL1940246
TypeSmall organic molecule
Emp. Form.C25H26FN7O
Mol. Mass.459.5186
SMILESCC(C)n1cc(C(=O)c2cncc(N[C@@H]3CCC[C@@H]3c3ccc(F)cc3)n2)c2c(N)ncnc12