Reaction Details
TargetSerine/threonine-protein kinase MARK1
LigandBDBM50361644
Substrate/Competitorn/a
Meas. Tech.ChEMBL_799489 (CHEMBL1942297)
IC50 1300±n/a nM
Citation Murphy, STAlton, GBailey, SBaxi, SMBurke, BJChappie, TAErmolieff, JFerre, RGreasley, SHickey, MHumphrey, JKablaoui, NKath, JKazmirski, SKraus, MKupchinsky, SLi, JLingardo, LMarx, MARichter, DTanis, SPTran, KVernier, WXie, ZYin, MJYu, XH Discovery of novel, potent, and selective inhibitors of 3-phosphoinositide-dependent kinase (PDK1). J Med Chem54:8490-500 (2011) 
 
Serine/threonine-protein kinase MARK1
Name:Serine/threonine-protein kinase MARK1
Type:Enzyme
Mol. Mass.:89034.85
Organism:Homo sapiens (Human)
Description:Q9P0L2
Residue:795
BDBM50361644
NameBDBM50361644
Synonyms:CHEMBL1940253
TypeSmall organic molecule
Emp. Form.C26H28N8O2
Mol. Mass.484.5529
SMILESCC(C)n1cc(C(=O)c2cncc(N[C@@H]3CCN([C@@H]3c3ccccc3)C(C)=O)n2)c2c(N)ncnc12