Reaction Details
TargetAdenosine receptor A2a
LigandBDBM50339076
Substrate/Competitorn/a
Meas. Tech.ChEMBL_800432 (CHEMBL1948453)
Ki 7.19±n/a nM
Citation Hou, XMajik, MSKim, KPyee, YLee, YAlexander, VChung, HJLee, HWChandra, GLee, JHPark, SGChoi, WJKim, HOPhan, KGao, ZGJacobson, KAChoi, SLee, SKJeong, LS Structure-activity relationships of truncated C2- or C8-substituted adenosine derivatives as dual acting A2A and A3 adenosine receptor ligands. J Med Chem55:342-56 (2012) 
 
Adenosine receptor A2a
Name:Adenosine receptor A2a
Type:G Protein-Coupled Receptor (GPCR)
Mol. Mass.:44716.46
Organism:Homo sapiens (Human)
Description:P29274
Residue:412
BDBM50339076
NameBDBM50339076
Synonyms:(2R,3R,4S)-2-(6-amino-2-(hex-1-ynyl)-9H-purin-9-yl)tetrahydrothiophene-3,4-diol | CHEMBL1688378
TypeSmall organic molecule
Emp. Form.C15H19N5O2S
Mol. Mass.333.409
SMILESCCCCC#Cc1nc(N)c2ncn([C@@H]3SC[C@@H](O)[C@H]3O)c2n1