Reaction Details
TargetPhosphatidylinositol 4,5-bisphosphate 3-kinase catalytic subunit alpha isoform
LigandBDBM50419767
Substrate/Competitorn/a
Meas. Tech.ChEMBL_803980 (CHEMBL1954960)
Ki 30±n/a nM
Citation Heffron, TPWei, BOlivero, AStaben, STTsui, VDo, SDotson, JFolkes, AJGoldsmith, PGoldsmith, RGunzner, JLesnick, JLewis, CMathieu, SNonomiya, JShuttleworth, SSutherlin, DPWan, NCWang, SWiesmann, CZhu, BY Rational design of phosphoinositide 3-kinasea inhibitors that exhibit selectivity over the phosphoinositide 3-kinaseß isoform. J Med Chem54:7815-33 (2011) 
 
Phosphatidylinositol 4,5-bisphosphate 3-kinase catalytic subunit alpha isoform
Name:Phosphatidylinositol 4,5-bisphosphate 3-kinase catalytic subunit alpha isoform
Type:Enzyme Subunit
Mol. Mass.:124294.87
Organism:Homo sapiens (Human)
Description:P42336
Residue:1068
BDBM50419767
NameBDBM50419767
Synonyms:CHEMBL1949925
TypeSmall organic molecule
Emp. Form.C28H22ClNO4S
Mol. Mass.503.997
SMILESCN(C(=O)c1cc2CCOc3cc(ccc3-c2s1)-c1cccc(CC(O)=O)c1)c1ccccc1Cl