Reaction Details
TargetPhosphatidylinositol 4,5-bisphosphate 3-kinase catalytic subunit alpha isoform
LigandBDBM50419773
Substrate/Competitorn/a
Meas. Tech.ChEMBL_803980 (CHEMBL1954960)
Ki 2±n/a nM
Citation Heffron, TPWei, BOlivero, AStaben, STTsui, VDo, SDotson, JFolkes, AJGoldsmith, PGoldsmith, RGunzner, JLesnick, JLewis, CMathieu, SNonomiya, JShuttleworth, SSutherlin, DPWan, NCWang, SWiesmann, CZhu, BY Rational design of phosphoinositide 3-kinasea inhibitors that exhibit selectivity over the phosphoinositide 3-kinaseß isoform. J Med Chem54:7815-33 (2011) 
 
Phosphatidylinositol 4,5-bisphosphate 3-kinase catalytic subunit alpha isoform
Name:Phosphatidylinositol 4,5-bisphosphate 3-kinase catalytic subunit alpha isoform
Type:Enzyme Subunit
Mol. Mass.:124294.87
Organism:Homo sapiens (Human)
Description:P42336
Residue:1068
BDBM50419773
NameBDBM50419773
Synonyms:CHEMBL1949917
TypeSmall organic molecule
Emp. Form.C17H21N7O3S2
Mol. Mass.435.524
SMILESCN(Cc1cc2c(nc(nc2s1)-c1cnc(N)nc1)N1CCOCC1)S(C)(=O)=O