Reaction Details
TargetTGF-beta receptor type-1
LigandBDBM50365553
Substrate/Competitorn/a
Meas. Tech.ChEMBL_808007 (CHEMBL1961066)
IC50 8.2±n/a nM
Citation Amada, HSekiguchi, YOno, NMatsunaga, YKoami, TAsanuma, HShiozawa, FEndo, MIkeda, AAoki, MFujimoto, NWada, RSato, M Design, synthesis, and evaluation of novel 4-thiazolylimidazoles as inhibitors of transforming growth factor-ß type I receptor kinase. Bioorg Med Chem Lett22:2024-9 (2012) 
 
TGF-beta receptor type-1
Name:TGF-beta receptor type-1
Type:enzyme
Mol. Mass.:55968.24
Organism:Homo sapiens (Human)
Description:P36897
Residue:503
BDBM50365553
NameBDBM50365553
Synonyms:CHEMBL1957675
TypeSmall organic molecule
Emp. Form.C19H19N5OS2
Mol. Mass.397.517
SMILESCCCC(=O)NCc1nc(c([nH]1)-c1nc(C)cs1)-c1ccc2ncsc2c1