Reaction Details
TargetSerine protease 1
LigandBDBM50366642
Substrate/Competitorn/a
Meas. Tech.ChEBML_213072
Ki 1780±n/a nM
Citation Baettig, UBrown, LBrundish, DDell, CFurzer, AGarman, SJanus, DKane, PDSmith, GWalker, CVCockcroft, XAmbler, JMitchelson, ATalbot, MDTweed, MWills, N The design and synthesis of thrombin inhibitors: analogues of MD805 containing non-polar surrogates for arginine at the P1 position. Bioorg Med Chem Lett10:1563-6 (2000) Serine protease 1
Name:Serine protease 1
Type:Enzyme
Mol. Mass.:26557.80
Organism:Homo sapiens (Human)
Description:P07477
Residue:247
BDBM50366642
NameBDBM50366642
Synonyms:CHEMBL1907779
TypeSmall organic molecule
Emp. Form.C24H40N4O4S2
Mol. Mass.512.729
SMILESCC1(C)CNc2c(C1)cccc2S(=O)(=O)N[C@@H](CSCCCN)C(=O)N1CCC(CCO)CC1