Reaction Details
TargetSerine protease 1
LigandBDBM50090231
Substrate/Competitorn/a
Meas. Tech.ChEBML_213072
Ki 260000±n/a nM
Citation Baettig, UBrown, LBrundish, DDell, CFurzer, AGarman, SJanus, DKane, PDSmith, GWalker, CVCockcroft, XAmbler, JMitchelson, ATalbot, MDTweed, MWills, N The design and synthesis of thrombin inhibitors: analogues of MD805 containing non-polar surrogates for arginine at the P1 position. Bioorg Med Chem Lett10:1563-6 (2000) Serine protease 1
Name:Serine protease 1
Type:Enzyme
Mol. Mass.:26557.80
Organism:Homo sapiens (Human)
Description:P07477
Residue:247
BDBM50090231
NameBDBM50090231
Synonyms:CHEMBL39375 | MD805 Analogue
TypeSmall organic molecule
Emp. Form.C28H36N4O3S2
Mol. Mass.540.74
SMILESCCC1CCN(CC1)C(=O)C(Cc1nc2ccccc2s1)NS(=O)(=O)c1cccc2CC(C)(C)CNc12