Reaction Details
TargetAcetylcholinesterase
LigandBDBM50117614
Substrate/Competitorn/a
Meas. Tech.ChEBML_28291
EC50 2700±n/a nM
Citation Palin, RClark, JKCowley, PMuir, AWPow, EProsser, ABTaylor, RZhang, MQ Novel piperidinium and pyridinium agents as water-soluble acetylcholinesterase inhibitors for the reversal of neuromuscular blockade. Bioorg Med Chem Lett12:2569-72 (2002) Acetylcholinesterase
Name:Acetylcholinesterase
Type:Enzyme
Mol. Mass.:67792.70
Organism:Homo sapiens (Human)
Description:P22303
Residue:614
BDBM50117614
NameBDBM50117614
Synonyms:4-[3-(5,6-Dimethoxy-benzo[b]thiophen-2-yl)-3-oxo-propyl]-1-thiophen-3-ylmethyl-pyridinium | CHEMBL87649
TypeSmall organic molecule
Emp. Form.C23H22NO3S2
Mol. Mass.424.555
SMILESCOc1cc2cc(sc2cc1OC)C(=O)CCc1cc[n+](Cc2ccsc2)cc1