Reaction Details
TargetBeta-secretase 1
LigandBDBM50137708
Substrate/Competitorn/a
Meas. Tech.ChEMBL_41387 (CHEMBL653509)
IC50 45±n/a nM
Citation Chen, SHLamar, JGuo, DKohn, TYang, HCMcGee, JTimm, DErickson, JYip, YMay, PMcCarthy, J P3 cap modified Phe*-Ala series BACE inhibitors. Bioorg Med Chem Lett14:245-50 (2003) Beta-secretase 1
Name:Beta-secretase 1
Type:Protein
Mol. Mass.:55755.10
Organism:Homo sapiens (Human)
Description:P56817
Residue:501
BDBM50137708
NameBDBM50137708
Synonyms:(S)-5-[(S)-5,5-Difluoro-2-((2S,3S)-2-hydroxy-3-methyl-pentanoylamino)-pentanoylamino]-2-(3,3-difluoro-propyl)-4-(S)-hydroxy-6-phenyl-hexanoic acid {(S)-2-methyl-1-[(pyridin-4-ylmethyl)-carbamoyl]-propyl}-amide | CHEMBL432560
TypeSmall organic molecule
Emp. Form.C37H53F4N5O6
Mol. Mass.739.8402
SMILESCC[C@H](C)[C@H](O)C(=O)N[C@@H](CCC(F)F)C(=O)N[C@@H](Cc1ccccc1)[C@@H](O)C[C@@H](CCC(F)F)C(=O)N[C@@H](C(C)C)C(=O)NCc1ccncc1