Reaction Details
TargetMu-type opioid receptor
LigandBDBM50452622
Substrate/Competitorn/a
Meas. Tech.ChEMBL_146569 (CHEMBL755058)
Ki>100±n/a nM
Citation Halfpenny, PRHill, RGHorwell, DCHughes, JHunter, JCJohnson, SRees, DC Highly selective kappa-opioid analgesics. 2. Synthesis and structure-activity relationships of novel N-[(2-aminocyclohexyl)aryl]acetamide derivatives. J Med Chem32:1620-6 (1989) Mu-type opioid receptor
Name:Mu-type opioid receptor
Type:G Protein-Coupled Receptor (GPCR)
Mol. Mass.:44789.51
Organism:Homo sapiens (Human)
Description:P35372
Residue:400
BDBM50452622
NameBDBM50452622
Synonyms:CHEMBL2093981
TypeSmall organic molecule
Emp. Form.C22H31ClN2O2S
Mol. Mass.423.012
SMILESCl.CN([C@@H]1CCCC[C@H]1N1CCC[C@H]1CO)C(=O)Cc1cccc2sccc12