Reaction Details
TargetKappa-type opioid receptor
LigandBDBM50017497
Substrate/Competitorn/a
Meas. Tech.ChEBML_145957
Ki 154±n/a nM
Citation Halfpenny, PRHill, RGHorwell, DCHughes, JHunter, JCJohnson, SRees, DC Highly selective kappa-opioid analgesics. 2. Synthesis and structure-activity relationships of novel N-[(2-aminocyclohexyl)aryl]acetamide derivatives. J Med Chem32:1620-6 (1989) Kappa-type opioid receptor
Name:Kappa-type opioid receptor
Type:G Protein-Coupled Receptor (GPCR)
Mol. Mass.:42648.76
Organism:Homo sapiens (Human)
Description:P41145
Residue:380
BDBM50017497
NameBDBM50017497
Synonyms:2-Benzo[b]thiophen-4-yl-N-methyl-N-(2-pyrrolidin-1-yl-cyclopentyl)-acetamide; hydrochloride | CHEMBL553010
TypeSmall organic molecule
Emp. Form.C20H26N2OS
Mol. Mass.342.498
SMILESCN([C@@H]1CCC[C@H]1N1CCCC1)C(=O)Cc1cccc2sccc12