Reaction Details
TargetMu-type opioid receptor
LigandBDBM50017497
Substrate/Competitorn/a
Meas. Tech.ChEMBL_146569 (CHEMBL755058)
Ki 3600±n/a nM
Citation Halfpenny, PRHill, RGHorwell, DCHughes, JHunter, JCJohnson, SRees, DC Highly selective kappa-opioid analgesics. 2. Synthesis and structure-activity relationships of novel N-[(2-aminocyclohexyl)aryl]acetamide derivatives. J Med Chem32:1620-6 (1989) Mu-type opioid receptor
Name:Mu-type opioid receptor
Type:G Protein-Coupled Receptor (GPCR)
Mol. Mass.:44789.51
Organism:Homo sapiens (Human)
Description:P35372
Residue:400
BDBM50017497
NameBDBM50017497
Synonyms:2-Benzo[b]thiophen-4-yl-N-methyl-N-(2-pyrrolidin-1-yl-cyclopentyl)-acetamide; hydrochloride | CHEMBL553010
TypeSmall organic molecule
Emp. Form.C20H26N2OS
Mol. Mass.342.498
SMILESCN([C@@H]1CCC[C@H]1N1CCCC1)C(=O)Cc1cccc2sccc12