Reaction Details
TargetKappa-type opioid receptor
LigandBDBM50017501
Substrate/Competitorn/a
Meas. Tech.ChEBML_145957
Ki 146±n/a nM
Citation Halfpenny, PRHill, RGHorwell, DCHughes, JHunter, JCJohnson, SRees, DC Highly selective kappa-opioid analgesics. 2. Synthesis and structure-activity relationships of novel N-[(2-aminocyclohexyl)aryl]acetamide derivatives. J Med Chem32:1620-6 (1989) Kappa-type opioid receptor
Name:Kappa-type opioid receptor
Type:G Protein-Coupled Receptor (GPCR)
Mol. Mass.:42648.76
Organism:Homo sapiens (Human)
Description:P41145
Residue:380
BDBM50017501
NameBDBM50017501
Synonyms:2-Benzo[b]thiophen-6-yl-N-methyl-N-(2-pyrrolidin-1-yl-cyclohexyl)-acetamide; hydrochloride | CHEMBL558227
TypeSmall organic molecule
Emp. Form.C21H28N2OS
Mol. Mass.356.525
SMILESCN([C@@H]1CCCC[C@H]1N1CCCC1)C(=O)Cc1ccc2ccsc2c1