Reaction Details
TargetMu-type opioid receptor
LigandBDBM50017498
Substrate/Competitorn/a
Meas. Tech.ChEBML_149320
Ki 4100±n/a nM
Citation Halfpenny, PRHill, RGHorwell, DCHughes, JHunter, JCJohnson, SRees, DC Highly selective kappa-opioid analgesics. 2. Synthesis and structure-activity relationships of novel N-[(2-aminocyclohexyl)aryl]acetamide derivatives. J Med Chem32:1620-6 (1989) Mu-type opioid receptor
Name:Mu-type opioid receptor
Type:G Protein-Coupled Receptor (GPCR)
Mol. Mass.:44789.51
Organism:Homo sapiens (Human)
Description:P35372
Residue:400
BDBM50017498
NameBDBM50017498
Synonyms:2-Benzofuran-4-yl-N-[2-(3-hydroxymethyl-pyrrolidin-1-yl)-cyclohexyl]-N-methyl-acetamide; hydrochloride | CHEMBL543301
TypeSmall organic molecule
Emp. Form.C22H30N2O3
Mol. Mass.370.4852
SMILESCN([C@@H]1CCCC[C@H]1N1CCC(CO)C1)C(=O)Cc1cccc2occc12