Reaction Details
TargetMu-type opioid receptor
LigandBDBM50017507
Substrate/Competitorn/a
Meas. Tech.ChEMBL_146569 (CHEMBL755058)
Ki 760±n/a nM
Citation Halfpenny, PRHill, RGHorwell, DCHughes, JHunter, JCJohnson, SRees, DC Highly selective kappa-opioid analgesics. 2. Synthesis and structure-activity relationships of novel N-[(2-aminocyclohexyl)aryl]acetamide derivatives. J Med Chem32:1620-6 (1989) Mu-type opioid receptor
Name:Mu-type opioid receptor
Type:G Protein-Coupled Receptor (GPCR)
Mol. Mass.:44789.51
Organism:Homo sapiens (Human)
Description:P35372
Residue:400
BDBM50017507
NameBDBM50017507
Synonyms:CHEMBL553665 | Pentanedioic acid bis-(1-{2-[(2-benzofuran-4-yl-acetyl)-methyl-amino]-cyclohexyl}-pyrrolidin-3-ylmethyl) ester;Dihydrochloride
TypeSmall organic molecule
Emp. Form.C49H64N4O8
Mol. Mass.837.0545
SMILESCN([C@H]1CCCC[C@@H]1N1CCC(COC(=O)CCCC(=O)OCC2CCN(C2)[C@@H]2CCCC[C@H]2N(C)C(=O)Cc2cccc3occc23)C1)C(=O)Cc1cccc2occc12