Reaction Details
TargetKappa-type opioid receptor
LigandBDBM50017493
Substrate/Competitorn/a
Meas. Tech.ChEBML_145957
Ki 2000±n/a nM
Citation Halfpenny, PRHill, RGHorwell, DCHughes, JHunter, JCJohnson, SRees, DC Highly selective kappa-opioid analgesics. 2. Synthesis and structure-activity relationships of novel N-[(2-aminocyclohexyl)aryl]acetamide derivatives. J Med Chem32:1620-6 (1989) Kappa-type opioid receptor
Name:Kappa-type opioid receptor
Type:G Protein-Coupled Receptor (GPCR)
Mol. Mass.:42648.76
Organism:Homo sapiens (Human)
Description:P41145
Residue:380
BDBM50017493
NameBDBM50017493
Synonyms:2-Benzo[b]thiophen-4-yl-N-pentyl-N-(2-pyrrolidin-1-yl-ethyl)-acetamide; hydrochloride | CHEMBL542102
TypeSmall organic molecule
Emp. Form.C21H30N2OS
Mol. Mass.358.541
SMILESCCCCCN(CCN1CCCC1)C(=O)Cc1cccc2sccc12