Reaction Details
Target5-hydroxytryptamine receptor 3A/3B
LigandBDBM50014174
Substrate/Competitorn/a
Meas. Tech.ChEMBL_3142 (CHEMBL617984)
Ki 0.990000±n/a nM
Citation Nagel, AARosen, TRizzi, JDaffeh, JGuarino, KNowakowski, JVincent, LAHeym, JMcLean, SSeeger, T Aromatic thiazole derivatives: structurally novel and selective serotonin-3 receptor antagonists. J Med Chem33:13-6 (1990) 5-hydroxytryptamine receptor 3A/3B
Name:5-hydroxytryptamine receptor 3A/3B
Type:n/a
Mol. Mass.:n/a
Description:ASSAY_ID of EBI is 2974
Components:This complex has 2 components.
Component 1
Name:5-hydroxytryptamine receptor 3B
Synonyms:5HT3B_RAT Serotonin (5-HT) receptor
Type:PROTEIN
Mol. Mass.:50328.78
Organism:Rattus norvegicus
Description:EBI_11885
Residue:437
Component 2
Name:5-hydroxytryptamine receptor 3A
Synonyms:5-HT3 5HT3A_RAT Htr3 Serotonin (5-HT) receptor | Zacopride site-R
Type:Enzyme Catalytic Domain
Mol. Mass.:55428.70
Organism:RAT
Description:5-HT3 HTR3A RAT::P35563
Residue:483
BDBM50014174
NameBDBM50014174
Synonyms:2-(1H-Imidazol-4-ylmethyl)-4-phenyl-thiazole | CHEMBL289060
TypeSmall organic molecule
Emp. Form.C13H11N3S
Mol. Mass.241.312
SMILESC(c1cnc[nH]1)c1nc(cs1)-c1ccccc1