Reaction Details
TargetKappa-type opioid receptor
LigandBDBM50367937
Substrate/Competitorn/a
Meas. Tech.ChEBML_146388
Ki 0.830000±n/a nM
Citation Halfpenny, PRHorwell, DCHughes, JHunter, JCRees, DC Highly selective kappa-opioid analgesics. 3. Synthesis and structure-activity relationships of novel N-[2-(1-pyrrolidinyl)-4- or -5-substituted-cyclohexyl]arylacetamide derivatives. J Med Chem33:286-91 (1990) Kappa-type opioid receptor
Name:Kappa-type opioid receptor
Type:G Protein-Coupled Receptor (GPCR)
Mol. Mass.:42744.99
Organism:Cavia porcellus (domestic guinea pig)
Description:P41144
Residue:380
BDBM50367937
NameBDBM50367937
Synonyms:CHEMBL1202931
TypeSmall organic molecule
Emp. Form.C24H32N2O3
Mol. Mass.396.5225
SMILESCN([C@@H]1CC[C@]2(CCCO2)C[C@H]1N1CCCC1)C(=O)Cc1cccc2occc12