Reaction Details
TargetAtrial natriuretic peptide receptor 2
LigandBDBM50013338
Substrate/Competitorn/a
Meas. Tech.ChEBML_35003
IC50 1.4±n/a nM
Citation DiMaio, JJaramillo, JWernic, DGrenier, LWelchner, EAdams, J Synthesis and biological activity of atrial natriuretic factor analogues: effect of modifications to the disulfide bridge. J Med Chem33:661-7 (1990) Atrial natriuretic peptide receptor 2
Name:Atrial natriuretic peptide receptor 2
Type:PROTEIN
Mol. Mass.:117152.29
Organism:Bos taurus
Description:ChEMBL_35003
Residue:1047
BDBM50013338
NameBDBM50013338
Synonyms:CHEMBL413659 | r-ANF (103-126)(Atrial Natriuretic Factor)
TypeSmall organic molecule
Emp. Form.C107H165N35O34S2
Mol. Mass.2549.799
SMILESCC[C@H](C)[C@@H]1NC(=O)[C@H](CCCNC(N)=N)NC(=O)[C@H](CC(O)=O)NC(=O)[C@@H](NC(=O)[C@H](CCCNC(N)=N)NC(=O)CNC(=O)CNC(=O)[C@H](Cc2ccccc2)NC(=O)[C@H](CSSC[C@H](NC(=O)CNC(=O)[C@H](CC(C)C)NC(=O)CNC(=O)[C@@H](CO)NC(=O)[C@H](CCC(N)=O)NC(=O)[C@H](C)NC(=O)CNC1=O)C(=O)N[C@@H](CC(N)=O)C(=O)N[C@@H](CO)C(=O)N[C@@H](Cc1ccccc1)C(=O)N[C@@H](CCCNC(N)=N)C(=O)N[C@@H](Cc1ccc(O)cc1)C(O)=O)NC(=O)[C@H](CO)NC(=O)[C@@H](N)CO)[C@@H](C)CC