Reaction Details
TargetGastrin/cholecystokinin type B receptor
LigandBDBM50007436
Substrate/Competitorn/a
Meas. Tech.ChEBML_48263
IC50 3.4±n/a nM
Citation Horwell, DCHughes, JHunter, JCPritchard, MCRichardson, RSRoberts, EWoodruff, GN Rationally designed"dipeptoid" analogues of CCK. alpha-Methyltryptophan derivatives as highly selective and orally active gastrin and CCK-B antagonists with potent anxiolytic properties. J Med Chem34:404-14 (1991) Gastrin/cholecystokinin type B receptor
Name:Gastrin/cholecystokinin type B receptor
Type:Enzyme Catalytic Domain
Mol. Mass.:49196.59
Organism:MOUSE
Description:Cholecystokinin A CCKBR MOUSE::P56481
Residue:453
BDBM50007436
NameBDBM50007436
Synonyms:CHEMBL334346 | Succinic acid mono-{2-[2-(adamantan-2-yloxycarbonylamino)-3-(1H-indol-3-yl)-2-methyl-propionylamino]-3-phenyl-propyl} ester
TypeSmall organic molecule
Emp. Form.C36H43N3O7
Mol. Mass.629.7425
SMILESC[C@](Cc1c[nH]c2ccccc12)(NC(=O)OC1[C@H]2C[C@@H]3C[C@@H](C[C@H]1C3)C2)C(=O)N[C@H](COC(=O)CCC(O)=O)Cc1ccccc1