Reaction Details
TargetGastrin/cholecystokinin type B receptor
LigandBDBM50007446
Substrate/Competitorn/a
Meas. Tech.ChEMBL_48263 (CHEMBL663168)
IC50 4.2±n/a nM
Citation Horwell, DCHughes, JHunter, JCPritchard, MCRichardson, RSRoberts, EWoodruff, GN Rationally designed"dipeptoid" analogues of CCK. alpha-Methyltryptophan derivatives as highly selective and orally active gastrin and CCK-B antagonists with potent anxiolytic properties. J Med Chem34:404-14 (1991) Gastrin/cholecystokinin type B receptor
Name:Gastrin/cholecystokinin type B receptor
Type:Enzyme Catalytic Domain
Mol. Mass.:49196.59
Organism:MOUSE
Description:Cholecystokinin A CCKBR MOUSE::P56481
Residue:453
BDBM50007446
NameBDBM50007446
Synonyms:CHEMBL335914 | N-{2-[2-(Adamantan-2-yloxycarbonylamino)-3-(1H-indol-3-yl)-2-methyl-propionylamino]-3-phenyl-propyl}-succinamic acid
TypeSmall organic molecule
Emp. Form.C36H44N4O6
Mol. Mass.628.7578
SMILESC[C@](Cc1c[nH]c2ccccc12)(NC(=O)OC1[C@H]2C[C@@H]3C[C@@H](C[C@H]1C3)C2)C(=O)N[C@H](CNC(=O)CCC(O)=O)Cc1ccccc1