Reaction Details
TargetOxytocin receptor
LigandBDBM50368435
Substrate/Competitorn/a
Meas. Tech.ChEBML_149039
Ki 9.4±n/a nM
Citation Williams, PDBock, MGTung, RDGarsky, VMPerlow, DSErb, JMLundell, GFGould, NPWhitter, WLHoffman, JB Development of a novel class of cyclic hexapeptide oxytocin antagonists based on a natural product. J Med Chem35:3905-18 (1992) Oxytocin receptor
Name:Oxytocin receptor
Type:Enzyme Catalytic Domain
Mol. Mass.:42793.26
Organism:Homo sapiens (Human)
Description:Oxytocin OXTR HEK293::B2R9L7
Residue:389
BDBM50368435
NameBDBM50368435
Synonyms:CHEMBL1790937
TypeSmall organic molecule
Emp. Form.C40H53N9O6
Mol. Mass.755.9055
SMILESCC[C@@H](C)[C@@H]1NC(=O)[C@@H](Cc2c[nH]c3ccccc23)NC(=O)[C@@H]2CCCN2C(=O)[C@@H](Cc2cnc[nH]2)NC(=O)[C@@H]2CCCCN2C(=O)[C@H]2CCCCN2C1=O