Reaction Details
TargetSubstance-P receptor
LigandBDBM50001606
Substrate/Competitorn/a
Meas. Tech.ChEBML_205400
EC50 86±n/a nM
Citation Deal, MJHagan, RMIreland, SJJordan, CCMcElroy, ABPorter, BRoss, BCStephens-Smith, MWard, P Conformationally constrained tachykinin analogues: potent and highly selective neurokinin NK-2 receptor agonists. J Med Chem35:4195-204 (1992) Substance-P receptor
Name:Substance-P receptor
Type:Enzyme Catalytic Domain
Mol. Mass.:46261.42
Organism:GUINEA PIG
Description:Neurokinin NK1 TACR1 GUINEA PIG::P30547
Residue:407
BDBM50001606
NameBDBM50001606
Synonyms:2-(2-{2-[2-(5-Amino-pentanoylamino)-3-phenyl-propionylamino]-3-methyl-butyrylamino}-acetylamino)-4-methyl-pentanoic acid (1-carbamoyl-3-methylsulfanyl-propyl)-amide | CHEMBL335248
TypeSmall organic molecule
Emp. Form.C32H53N7O6S
Mol. Mass.663.872
SMILESCSCC[C@H](NC(=O)[C@H](CC(C)C)NC(=O)CNC(=O)[C@@H](NC(=O)[C@H](Cc1ccccc1)NC(=O)CCCCN)C(C)C)C(N)=O