Reaction Details
TargetAminopeptidase N
LigandBDBM50002031
Substrate/Competitorn/a
Meas. Tech.ChEBML_35491
IC50 11±n/a nM
Citation Fournié-Zaluski, MCCoric, PTurcaud, SBruetschy, LLucas, ENoble, FRoques, BP Potent and systemically active aminopeptidase N inhibitors designed from active-site investigation. J Med Chem35:1259-66 (1992) Aminopeptidase N
Name:Aminopeptidase N
Type:Protein
Mol. Mass.:108810.25
Organism:Sus scrofa (Pig)
Description:P15145
Residue:963
BDBM50002031
NameBDBM50002031
Synonyms:1-Mercaptomethyl-3-methylsulfanyl-propyl-ammonium
TypeSmall organic molecule
Emp. Form.C5H14NS2
Mol. Mass.152.301
SMILESCSCCC([NH3+])CS