Reaction Details
TargetAminopeptidase N
LigandBDBM50002026
Substrate/Competitorn/a
Meas. Tech.ChEBML_35491
IC50 20±n/a nM
Citation Fournié-Zaluski, MCCoric, PTurcaud, SBruetschy, LLucas, ENoble, FRoques, BP Potent and systemically active aminopeptidase N inhibitors designed from active-site investigation. J Med Chem35:1259-66 (1992) Aminopeptidase N
Name:Aminopeptidase N
Type:Protein
Mol. Mass.:108810.25
Organism:Sus scrofa (Pig)
Description:P15145
Residue:963
BDBM50002026
NameBDBM50002026
Synonyms:2-Mercapto-1-methylsulfanylmethyl-ethyl-ammonium
TypeSmall organic molecule
Emp. Form.C4H12NS2
Mol. Mass.138.274
SMILESCSCC([NH3+])CS