Reaction Details
TargetGag-Pol polyprotein [489-587]
LigandBDBM50091606
Substrate/Competitorn/a
Meas. Tech.ChEMBL_159321 (CHEMBL769374)
IC50 0.11±n/a nM
Citation Dorsey, BDMcDonough, CMcDaniel, SLLevin, RBNewton, CLHoffman, JMDarke, PLZugay-Murphy, JAEmini, EASchleif, WAOlsen, DBStahlhut, MWRutkowski, CAKuo, LCLin, JHChen, IWMichelson, SRHolloway, MKHuff, JRVacca, JP Identification of MK-944a: a second clinical candidate from the hydroxylaminepentanamide isostere series of HIV protease inhibitors. J Med Chem43:3386-99 (2000) Gag-Pol polyprotein [489-587]
Name:Gag-Pol polyprotein [489-587]
Type:Enzyme Subunit
Mol. Mass.:10781.16
Organism:Human immunodeficiency virus type 1
Description:P04585[489-587]
Residue:99
BDBM50091606
NameBDBM50091606
Synonyms:1-[2-Hydroxy-4-(2-hydroxy-indan-1-ylcarbamoyl)-5-phenyl-pentyl]-4-(3-methyl-benzofuran-2-ylmethyl)-piperazine-2-carboxylic acid tert-butylamide | CHEMBL331155
TypeSmall organic molecule
Emp. Form.C40H50N4O5
Mol. Mass.666.8488
SMILESCc1c(CN2CCN(CC(O)CC(Cc3ccccc3)C(=O)NC3C(O)Cc4ccccc34)C(C2)C(=O)NC(C)(C)C)oc2ccccc12