Reaction Details
TargetGag-Pol polyprotein [489-587]
LigandBDBM50091615
Substrate/Competitorn/a
Meas. Tech.ChEMBL_159321 (CHEMBL769374)
IC50 0.14±n/a nM
Citation Dorsey, BDMcDonough, CMcDaniel, SLLevin, RBNewton, CLHoffman, JMDarke, PLZugay-Murphy, JAEmini, EASchleif, WAOlsen, DBStahlhut, MWRutkowski, CAKuo, LCLin, JHChen, IWMichelson, SRHolloway, MKHuff, JRVacca, JP Identification of MK-944a: a second clinical candidate from the hydroxylaminepentanamide isostere series of HIV protease inhibitors. J Med Chem43:3386-99 (2000) Gag-Pol polyprotein [489-587]
Name:Gag-Pol polyprotein [489-587]
Type:Enzyme Subunit
Mol. Mass.:10781.16
Organism:Human immunodeficiency virus type 1
Description:P04585[489-587]
Residue:99
BDBM50091615
NameBDBM50091615
Synonyms:4-(4-Chloro-1,3-dimethyl-1H-pyrazolo[3,4-b]pyridin-5-ylmethyl)-1-[2-hydroxy-4-(2-hydroxy-indan-1-ylcarbamoyl)-5-phenyl-pentyl]-piperazine-2-carboxylic acid tert-butylamide | CHEMBL326336
TypeSmall organic molecule
Emp. Form.C39H50ClN7O4
Mol. Mass.716.312
SMILESCc1nn(C)c2ncc(CN3CCN(C[C@@H](O)C[C@@H](Cc4ccccc4)C(=O)NC4[C@H](O)Cc5ccccc45)[C@@H](C3)C(=O)NC(C)(C)C)c(Cl)c12