Reaction Details
TargetcAMP-specific 3',5'-cyclic phosphodiesterase 4A
LigandBDBM50085141
Substrate/Competitorn/a
Meas. Tech.ChEMBL_155033 (CHEMBL765475)
IC50 1800±n/a nM
Citation Hersperger, RBray-French, KMazzoni, LMüller, T Palladium-catalyzed cross-coupling reactions for the synthesis of 6, 8-disubstituted 1,7-naphthyridines: a novel class of potent and selective phosphodiesterase type 4D inhibitors. J Med Chem43:675-82 (2000) cAMP-specific 3',5'-cyclic phosphodiesterase 4A
Name:cAMP-specific 3',5'-cyclic phosphodiesterase 4A
Type:Enzyme
Mol. Mass.:98113.27
Organism:Homo sapiens (Human)
Description:P27815
Residue:886
BDBM50085141
NameBDBM50085141
Synonyms:CHEMBL351900 | Trifluoro-methanesulfonic acid 8-(3-nitro-phenyl)-[1,7]naphthyridin-6-yl ester
TypeSmall organic molecule
Emp. Form.C15H8F3N3O5S
Mol. Mass.399.301
SMILES[O-][N+](=O)c1cccc(c1)-c1nc(OS(=O)(=O)C(F)(F)F)cc2cccnc12