Reaction Details
TargetHistamine H3 receptor
LigandBDBM50099623
Substrate/Competitorn/a
Meas. Tech.ChEMBL_86747 (CHEMBL694088)
Ki 0.18±n/a nM
Citation De Esch, IJMills, JEPerkins, TDRomeo, GHoffmann, MWieland, KLeurs, RMenge, WMNederkoorn, PHDean, PMTimmerman, H Development of a pharmacophore model for histamine H3 receptor antagonists, using the newly developed molecular modeling program SLATE. J Med Chem44:1666-74 (2001) Histamine H3 receptor
Name:Histamine H3 receptor
Type:G Protein-Coupled Receptor (GPCR)
Mol. Mass.:48607.98
Organism:Rattus norvegicus (rat)
Description:n/a
Residue:445
BDBM50099623
NameBDBM50099623
Synonyms:4-[2-(4,4-Dimethyl-pent-1-ynyl)-cyclopropyl]-1H-imidazole | CHEMBL45369
TypeSmall organic molecule
Emp. Form.C13H18N2
Mol. Mass.202.2954
SMILESCC(C)(C)CC#CC1CC1c1cnc[nH]1